{"text_format":"1","workbook":"xlsx","n_sheets":5,"sheets":["Symulacja","Taryfy","Zużycie prądu","Produkcja pradu2","Produkcja pradu"],"not_rendered":{"charts":0,"images":2,"macros":1,"external_links":0,"defined_names":0,"comments":0,"pivot_tables":0},"unopened":[],"bounds":{"document_bytes":16777216,"sheet_cells":100000,"rows_first":2000,"rows_last":500,"rows_between":2000,"halvings":0,"cell_chars":16384,"cell_head_chars":4096},"cells_cut":0,"cells_raw":0,"read":"whole","date_system":"1900"}

{"sheet":"Symulacja","index":0,"n_rows":67,"n_cols":36,"rows_kept":67,"cut":false,"hidden":false,"merged":[[6,3,6,4]]}
["Parametry",null,"Produkcja",5,null,null,null,"Zużycie",null,null,null,"Bateria",null,null,null,"Ceny",null,null,null,null,null,null,null,null,null,null,null,null,null,null,null,"Wersja:","2.1"]
["prod do godziny:",null,10,"kWp moc paneli",null,null,null,null,null,null,null,20,"kWh moc baterii",null,null,3,"nr taryfy",null,null,null,null,null,null,4500,"cena paneli za 1kWp"]
[24,null,0.9,"sprawność paneli",null,null,null,1,"zmiana zużycia",null,null,0.9,"sprawność baterii",null,null,{"$f":"Taryfy!$E$5*(1+P4)*0.5","v":0.47660039999999998},"cena sprzedaży prądu",null,null,{"$f":"Taryfy!$E$5*(1+P4)","v":0.95320079999999996},"cena wyceny prądu",null,null,1500,"cena baterii za 1kWh"]
[null,null,12,"miesiąc profilu produkcji",null,null,null,1,"nr profilu zuzycia",null,null,{"$f":"60*48/1000*L2/10","v":5.76},"kWh max ładowanie",null,null,0.2,"% podwyżki",null,null,null,null,null,null,5000,"dofinansowanie"]
[null,null,0,"dzień miesiąca (0 do 10)",null,null,null,null,null,null,null,0.65,"% pojemn. Bat.",null,null,1,"0/1 - ładowanie od 13-15 i w nocy"]
[null,null,{"$f":"INDEX('Produkcja pradu2'!$A$1:$Y$360,4+($C$4-1)*30,6)","v":1.9394503597680419},"mnożnik korekcyjny",null,null,"stan baterii",null,null,null,null,null,null,null,5,7,"nie ładuj od-do miesiąca",null,null,null,null,null,null,null,"stan baterii"]
[null,null,null,"bilans",null,null,"dzień 1",null,null,null,null,null,null,null,null,"dzień 2",null,null,null,null,null,null,null,null,"dzień 3"]
[null,"produkcja","zużycie","produkcji","zużycia",null,"ładowanie","ład z sieci","rozładowanie","stan","do sieci","z sieci","sprz prądu","zakup prądu",null,"ładowanie","ład z sieci","rozładowanie","stan","do sieci","z sieci","sprz prądu","zakup prądu",null,"ładowanie","ład z sieci","rozładowanie","stan","do sieci","z sieci","sprz prądu","zakup prądu",null,null,"Cena zakupu","ład z sieci"]
["godzina","kWh","kWh","kWh","kWh",null,"kWh","kWh","kWh",0,"kWh","kWh","zł","zł",null,"kWh","kWh","kWh",{"$f":"J33","v":13},"kWh","kWh","zł","zł",null,"kWh","kWh","kWh",{"$f":"S33","v":13},"kWh","kWh","zł","zł"]
[1,{"$f":"IF(A10>$A$3,0,INDEX('Produkcja pradu2'!$A$1:$Y$360,6+(A10-1)+($C$4-1)*30,2+$C$5)/'Produkcja pradu2'!$B$2*$C$2*$C$6)","v":0},{"$f":"INDEX('Zużycie prądu'!$A$4:$R$27,Symulacja!A10,3*Symulacja!$H$4)*$H$3","v":1.3125},{"$f":"IF(B10>C10,B10-C10,0)","v":0},{"$f":"IF(B10<C10,C10-B10,0)","v":1.3125},null,{"$f":"MIN($D10,$L$2*$L$5-J9,$L$4)","v":0},{"$f":"MIN($L$2*$L$5-J9-G10,$L$4-G10)*$AJ10","v":5.76},{"$f":"IF(AND(H10=0,$AJ10=0), MIN($E10,J9),0)","v":0},{"$f":"J9+G10*$L$3-I10+H10","v":5.76},{"$f":"IF($D10>G10,$D10-G10,0)","v":0},{"$f":"IF($E10>I10,$E10-I10,0)+H10","v":7.0724999999999998},{"$f":"K10*$P$3","v":0},{"$f":"L10*$AI10","v":4.243457564999999},null,{"$f":"MIN($D10,$L$2*$L$5-S9,$L$4)","v":0},{"$f":"MIN($L$2*$L$5-S9-P10,$L$4-P10)*$AJ10","v":0},{"$f":"IF(AND(Q10=0,$AJ10=0), MIN($E10,S9),0)","v":0},{"$f":"S9+P10*$L$3-R10+Q10","v":13},{"$f":"IF($D10>P10,$D10-P10,0)","v":0},{"$f":"IF($E10>R10,$E10-R10,0)+Q10","v":1.3125},{"$f":"T10*$P$3","v":0},{"$f":"U10*$AI10","v":0.78749212499999988},null,{"$f":"MIN($D10,$L$2*$L$5-AB9,$L$4)","v":0},{"$f":"MIN($L$2*$L$5-AB9-Y10,$L$4-Y10)*$AJ10","v":0},{"$f":"IF(AND(Z10=0,$AJ10=0), MIN($E10,AB9),0)","v":0},{"$f":"AB9+Y10*$L$3-AA10+Z10","v":13},{"$f":"IF($D10>Y10,$D10-Y10,0)","v":0},{"$f":"IF($E10>AA10,$E10-AA10,0)+Z10","v":1.3125},{"$f":"AC10*$P$3","v":0},{"$f":"AD10*$AI10","v":0.78749212499999988},null,null,{"$f":"INDEX(Taryfy!$A$5:$Z$28,Symulacja!A10,(Symulacja!$P$2-1)*4+5)*(1+$P$4)","v":0.59999399999999992},{"$f":"IF(AND($P$2>1, OR($C$4<$O$6,$C$4>$P$6)),$P$5,0)","v":1}]
[2,{"$f":"IF(A11>$A$3,0,INDEX('Produkcja pradu2'!$A$1:$Y$360,6+(A11-1)+($C$4-1)*30,2+$C$5)/'Produkcja pradu2'!$B$2*$C$2*$C$6)","v":0},{"$f":"INDEX('Zużycie prądu'!$A$4:$R$27,Symulacja!A11,3*Symulacja!$H$4)*$H$3","v":1.3125},{"$f":"IF(B11>C11,B11-C11,0)","v":0},{"$f":"IF(B11<C11,C11-B11,0)","v":1.3125},null,{"$f":"MIN($D11,$L$2*$L$5-J10,$L$4)","v":0},{"$f":"MIN($L$2*$L$5-J10-G11,$L$4-G11)*$AJ11","v":5.76},0,11.52,0,7.0724999999999998,{"$f":"K11*$P$3","v":0},4.243457564999999,null,0,0,0,13,0,1.3125,{"$f":"T11*$P$3","v":0},0.78749212499999988,null,0,0,0,13,0,1.3125,{"$f":"AC11*$P$3","v":0},0.78749212499999988,null,null,{"$f":"INDEX(Taryfy!$A$5:$Z$28,Symulacja!A11,(Symulacja!$P$2-1)*4+5)*(1+$P$4)","v":0.59999399999999992},{"$f":"IF(AND($P$2>1, OR($C$4<$O$6,$C$4>$P$6)),$P$5,0)","v":1}]
[3,{"$f":"IF(A12>$A$3,0,INDEX('Produkcja pradu2'!$A$1:$Y$360,6+(A12-1)+($C$4-1)*30,2+$C$5)/'Produkcja pradu2'!$B$2*$C$2*$C$6)","v":0},{"$f":"INDEX('Zużycie prądu'!$A$4:$R$27,Symulacja!A12,3*Symulacja!$H$4)*$H$3","v":1.3125},0,1.3125,null,0,1.4800000000000004,0,13,0,2.7925000000000004,0,1.6754832450000001,null,0,0,0,13,0,1.3125,0,0.78749212499999988,null,0,0,0,13,0,1.3125,0,0.78749212499999988,null,null,{"$f":"INDEX(Taryfy!$A$5:$Z$28,Symulacja!A12,(Symulacja!$P$2-1)*4+5)*(1+$P$4)","v":0.59999399999999992},1]
[4,{"$f":"IF(A13>$A$3,0,INDEX('Produkcja pradu2'!$A$1:$Y$360,6+(A13-1)+($C$4-1)*30,2+$C$5)/'Produkcja pradu2'!$B$2*$C$2*$C$6)","v":0},{"$f":"INDEX('Zużycie prądu'!$A$4:$R$27,Symulacja!A13,3*Symulacja!$H$4)*$H$3","v":1.3125},0,1.3125,null,0,0,0,13,0,1.3125,0,0.78749212499999988,null,0,0,0,13,0,1.3125,0,0.78749212499999988,null,0,0,0,13,0,1.3125,0,0.78749212499999988,null,null,{"$f":"INDEX(Taryfy!$A$5:$Z$28,Symulacja!A13,(Symulacja!$P$2-1)*4+5)*(1+$P$4)","v":0.59999399999999992},1]
[5,{"$f":"IF(A14>$A$3,0,INDEX('Produkcja pradu2'!$A$1:$Y$360,6+(A14-1)+($C$4-1)*30,2+$C$5)/'Produkcja pradu2'!$B$2*$C$2*$C$6)","v":0},{"$f":"INDEX('Zużycie prądu'!$A$4:$R$27,Symulacja!A14,3*Symulacja!$H$4)*$H$3","v":1.3125},0,1.3125,null,0,0,0,13,0,1.3125,0,0.78749212499999988,null,0,0,0,13,0,1.3125,0,0.78749212499999988,null,0,0,0,13,0,1.3125,0,0.78749212499999988,null,null,{"$f":"INDEX(Taryfy!$A$5:$Z$28,Symulacja!A14,(Symulacja!$P$2-1)*4+5)*(1+$P$4)","v":0.59999399999999992},1]
[6,{"$f":"IF(A15>$A$3,0,INDEX('Produkcja pradu2'!$A$1:$Y$360,6+(A15-1)+($C$4-1)*30,2+$C$5)/'Produkcja pradu2'!$B$2*$C$2*$C$6)","v":0},{"$f":"INDEX('Zużycie prądu'!$A$4:$R$27,Symulacja!A15,3*Symulacja!$H$4)*$H$3","v":1.3125},0,1.3125,null,0,0,1.3125,11.6875,0,0,0,0,null,0,0,1.3125,11.6875,0,0,0,0,null,0,0,1.3125,11.6875,0,0,0,0,null,null,{"$f":"INDEX(Taryfy!$A$5:$Z$28,Symulacja!A15,(Symulacja!$P$2-1)*4+5)*(1+$P$4)","v":1.1356344},0]
{"$rows_left_out":53}
{"sheet":"Taryfy","index":1,"n_rows":30,"n_cols":21,"rows_kept":30,"cut":false,"hidden":false,"merged":[]}
[null,null,1,null,null,null,2,null,null,null,3,null,null,null,4,null,null,null,5]
[null,null,"G11",null,null,null,"G12",null,null,null,"G12w - od pn do pt",null,null,null,"G12w - weekend",null,null,null,"G12n"]
[null,null,"normalna",null,null,null,"elastyczna",null,null,null,"weekendowa",null,null,null,"niedzielna",null,null,null,"niedzielna"]
[null,null,"obrót","dystrybucja","suma",null,"obrót","dystrybucja","suma",null,"obrót","dystrybucja","suma",null,"obrót","dystrybucja","suma",null,"obrót","dystrybucja","suma"]
[1,null,{"$f":"0.414*1.23","v":0.50922000000000001},{"$f":"(0.2223+0.0095)*1.23","v":0.28511399999999998},{"$f":"C5+D5","v":0.79433399999999998},null,{"$f":"0.2985*1.23","v":0.36715499999999995},{"$f":"(0.0496+0.0095)*1.23","v":7.2692999999999994E-2},{"$f":"G5+H5","v":0.43984799999999996},null,{"$f":"0.3429*1.23","v":0.42176699999999995},{"$f":"(0.0541+0.0095)*1.23","v":7.8228000000000006E-2},{"$f":"K5+L5","v":0.49999499999999997},null,{"$f":"K5","v":0.42176699999999995},{"$f":"L5","v":7.8228000000000006E-2},{"$f":"O5+P5","v":0.49999499999999997},null,{"$f":"0.3195*1.23","v":0.39298500000000003},{"$f":"(0.0399+0.0095)*1.23","v":6.0761999999999997E-2},{"$f":"S5+T5","v":0.45374700000000001}]
[2,null,{"$f":"C5","v":0.50922000000000001},{"$f":"D5","v":0.28511399999999998},{"$f":"C6+D6","v":0.79433399999999998},null,{"$f":"G5","v":0.36715499999999995},{"$f":"H5","v":7.2692999999999994E-2},0.43984799999999996,null,{"$f":"K5","v":0.42176699999999995},{"$f":"L5","v":7.8228000000000006E-2},0.49999499999999997,null,{"$f":"O5","v":0.42176699999999995},{"$f":"P5","v":7.8228000000000006E-2},0.49999499999999997,null,{"$f":"S5","v":0.39298500000000003},6.0761999999999997E-2,0.45374700000000001]
[3,null,{"$f":"C6","v":0.50922000000000001},0.28511399999999998,0.79433399999999998,null,{"$f":"G6","v":0.36715499999999995},7.2692999999999994E-2,0.43984799999999996,null,{"$f":"K6","v":0.42176699999999995},7.8228000000000006E-2,0.49999499999999997,null,{"$f":"O6","v":0.42176699999999995},7.8228000000000006E-2,0.49999499999999997,null,0.39298500000000003,6.0761999999999997E-2,0.45374700000000001]
[4,null,0.50922000000000001,0.28511399999999998,0.79433399999999998,null,0.36715499999999995,7.2692999999999994E-2,0.43984799999999996,null,0.42176699999999995,7.8228000000000006E-2,0.49999499999999997,null,0.42176699999999995,7.8228000000000006E-2,0.49999499999999997,null,0.39298500000000003,6.0761999999999997E-2,0.45374700000000001]
[5,null,0.50922000000000001,0.28511399999999998,0.79433399999999998,null,0.36715499999999995,7.2692999999999994E-2,0.43984799999999996,null,0.42176699999999995,7.8228000000000006E-2,0.49999499999999997,null,0.42176699999999995,7.8228000000000006E-2,0.49999499999999997,null,{"$f":"0.4601*1.23","v":0.56592299999999995},{"$f":"(0.2224+0.0095)*1.23","v":0.28523699999999996},0.85115999999999992]
[6,null,0.50922000000000001,0.28511399999999998,0.79433399999999998,null,{"$f":"0.4818*1.23","v":0.59261399999999997},{"$f":"(0.257+0.0095)*1.23","v":0.327795},0.92040900000000003,null,{"$f":"0.4877*1.23","v":0.59987100000000004},{"$f":"(0.2722+0.0095)*1.23","v":0.34649099999999999},0.94636200000000004,null,0.42176699999999995,7.8228000000000006E-2,0.49999499999999997,null,{"$f":"S9","v":0.56592299999999995},{"$f":"T9","v":0.28523699999999996},0.85115999999999992]
[7,null,0.50922000000000001,0.28511399999999998,0.79433399999999998,null,{"$f":"G10","v":0.59261399999999997},{"$f":"(0.2426+0.0102)*1.23","v":0.310944},0.90355799999999997,null,{"$f":"K10","v":0.59987100000000004},{"$f":"L10","v":0.34649099999999999},0.94636200000000004,null,0.42176699999999995,7.8228000000000006E-2,0.49999499999999997,null,{"$f":"S10","v":0.56592299999999995},0.28523699999999996,0.85115999999999992]
[8,null,0.50922000000000001,0.28511399999999998,0.79433399999999998,null,{"$f":"G11","v":0.59261399999999997},0.310944,0.90355799999999997,null,{"$f":"K11","v":0.59987100000000004},0.34649099999999999,0.94636200000000004,null,0.42176699999999995,7.8228000000000006E-2,0.49999499999999997,null,0.56592299999999995,0.28523699999999996,0.85115999999999992]
[9,null,0.50922000000000001,0.28511399999999998,0.79433399999999998,null,0.59261399999999997,0.310944,0.90355799999999997,null,0.59987100000000004,0.34649099999999999,0.94636200000000004,null,0.42176699999999995,7.8228000000000006E-2,0.49999499999999997,null,0.56592299999999995,0.28523699999999996,0.85115999999999992]
[10,null,0.50922000000000001,0.28511399999999998,0.79433399999999998,null,0.59261399999999997,0.310944,0.90355799999999997,null,0.59987100000000004,0.34649099999999999,0.94636200000000004,null,0.42176699999999995,7.8228000000000006E-2,0.49999499999999997,null,0.56592299999999995,0.28523699999999996,0.85115999999999992]
[11,null,0.50922000000000001,0.28511399999999998,0.79433399999999998,null,0.59261399999999997,0.310944,0.90355799999999997,null,0.59987100000000004,0.34649099999999999,0.94636200000000004,null,0.42176699999999995,7.8228000000000006E-2,0.49999499999999997,null,0.56592299999999995,0.28523699999999996,0.85115999999999992]
{"$rows_left_out":16}
{"sheet":"Zużycie prądu","index":2,"n_rows":29,"n_cols":9,"rows_kept":29,"cut":false,"hidden":false,"merged":[]}
[null,"2021-12-07","3 prania",null,"2021-12-08","1 pranie",null,"ostateczna"]
[null,1,"Zużycie(kWh) ",null,2,null,null,3]
[22,98257,null,"24:",98304.1,null,"24:"]
[1,null,{"$f":"(B$9-B$3)/8","v":1.3125},null,null,{"$f":"(E$9-E$3)/6","v":1.0833333333333333},null,null,1.3]
[2,null,{"$f":"(B$9-B$3)/8","v":1.3125},null,null,{"$f":"(E$9-E$3)/6","v":1.0833333333333333},null,null,1.0833333333333333]
[3,null,1.3125,null,null,1.0833333333333333,null,null,1.0833333333333333]
[4,null,1.3125,null,null,1.0833333333333333,null,null,1.0833333333333333]
[5,null,1.3125,null,null,1.0833333333333333,null,null,1.0833333333333333]
[6,98267.5,1.3125,null,98310.6,1.0833333333333333,null,null,1.0833333333333333]
[7,98268.800000000003,{"$f":"B10-B9","v":1.3000000000029104},null,98311.5,{"$f":"E10-E9","v":0.89999999999417923},null,null,0.89999999999417923]
[8,98270.1,{"$f":"B11-B10","v":1.3000000000029104},null,98312.8,{"$f":"E11-E10","v":1.3000000000029104},null,null,1.3000000000029104]
[9,98272.3,2.1999999999970896,null,98314.8,2,null,null,2]
[10,98274.1,1.8000000000029104,null,98316.4,1.5999999999912689,null,null,1.5999999999912689]
[11,98275.8,1.6999999999970896,null,98317.7,1.3000000000029104,null,null,1.3000000000029104]
[12,98277.6,1.8000000000029104,null,98318.8,1.1000000000058208,null,null,1.1000000000058208]
{"$rows_left_out":15}
{"sheet":"Produkcja pradu2","index":3,"n_rows":359,"n_cols":12,"rows_kept":359,"cut":false,"hidden":false,"merged":[]}
["źródło","https://pvmonitor.pl//i_user.php?idinst=13&od=2021-06-20&do=2021-06-20#/pv1"]
["kWp",16]
[null,null,null,"suma","powinno być","mnożnik"]
[null,null,"styczeń",{"$f":"SUM(C6:L29)*3","v":67.53},118,{"$f":"E4/D4","v":1.747371538575448}]
[null,"średnia",1,4,7,10,13,16,19,22,25,28]
[1,{"$f":"IF(COUNTA(C6:L6)>0, AVERAGE(C6:L6),0)","v":0}]
[2,0]
[3,0]
[4,0]
[5,0]
[6,0]
[7,5.8399999999999994E-2,null,null,null,null,null,0.06,5.8000000000000003E-2,5.6000000000000001E-2,6.3E-2,5.5E-2]
[8,7.010000000000001E-2,6.9000000000000006E-2,5.6000000000000001E-2,5.6000000000000001E-2,4.9000000000000002E-2,6.4000000000000001E-2,0.34699999999999998,3.2999999999999995E-2,1.0000000000000002E-2,7.9999999999999932E-3,9.0000000000000011E-3]
[9,0.21800000000000003,0.06,8.2000000000000017E-2,8.2000000000000017E-2,1.4999999999999999E-2,1.9000000000000003E-2,1.4969999999999999,0.13800000000000001,0.123,0.12100000000000001,4.2999999999999997E-2]
[10,0.35610000000000003,0.13400000000000001,5.1999999999999991E-2,5.1999999999999991E-2,3.8999999999999993E-2,8.7000000000000008E-2,2.2430000000000003,0.18499999999999997,0.45200000000000001,0.23699999999999999,0.08]
{"$rows_left_out":345}
{"sheet":"Produkcja pradu","index":4,"n_rows":35,"n_cols":25,"rows_kept":35,"cut":false,"hidden":false,"merged":[]}
["źródło","https://pvmonitor.pl//i_user.php?idinst=13&od=2021-06-20&do=2021-06-20#/pv1"]
["kWp",16]
[null,1,"% do 16",2,"% do 16",3,"% do 16",4,"% do 16",5,"% do 16",6,"% do 16",7,"% do 16",8,"% do 16",9,"% do 16",10,"% do 16",11,"% do 16",12,"% do 16"]
[1]
[2]
[3]
[4,null,null,null,null,null,null,null,null,0.13100000000000001,{"$f":"J7/$B$2","v":8.1875000000000003E-3},6.6000000000000003E-2,{"$f":"L7/$B$2","v":4.1250000000000002E-3},3.5000000000000003E-2,{"$f":"N7/$B$2","v":2.1875000000000002E-3}]
[5,null,null,null,null,0.42,{"$f":"F8/$B$2","v":2.6249999999999999E-2},0.28000000000000003,{"$f":"H8/$B$2","v":1.7500000000000002E-2},0.15899999999999997,9.9374999999999984E-3,0.38300000000000001,2.39375E-2,0.16500000000000001,1.03125E-2,7.3999999999999996E-2,{"$f":"P8/$B$2","v":4.6249999999999998E-3}]
[6,null,null,0.223,{"$f":"D9/$B$2","v":1.39375E-2},0.68000000000000016,4.250000000000001E-2,0.41899999999999993,2.6187499999999996E-2,1.411,8.8187500000000002E-2,1.7419999999999998,0.10887499999999999,1.298,8.1125000000000003E-2,0.78100000000000003,4.8812500000000002E-2,null,null,0.159,{"$f":"T9/$B$2","v":9.9375000000000002E-3}]
[7,0.28199999999999997,{"$f":"B10/$B$2","v":1.7624999999999998E-2},0.21199999999999999,1.325E-2,4.7899999999999991,0.29937499999999995,3.2110000000000003,0.20068750000000002,4.2789999999999999,0.26743749999999999,4.4710000000000001,0.27943750000000001,4.2329999999999997,0.26456249999999998,3.5370000000000004,0.22106250000000002,0.40400000000000003,{"$f":"R10/$B$2","v":2.5250000000000002E-2},0.46099999999999997,2.8812499999999998E-2,0.16900000000000001,{"$f":"V10/$B$2","v":1.0562500000000001E-2}]
[8,4.4000000000000039E-2,{"$f":"B11/$B$2","v":2.7500000000000024E-3},3.9090000000000003,0.24431250000000002,8.5109999999999992,0.53193749999999995,6.2889999999999997,0.39306249999999998,6.8710000000000004,0.42943750000000003,7.3790000000000004,0.46118750000000003,7.1340000000000003,0.44587500000000002,6.5979999999999999,0.41237499999999999,3.3170000000000002,0.20731250000000001,3.3899999999999997,0.21187499999999998,2.2869999999999999,0.1429375,0.14699999999999999,{"$f":"X11/$B$2","v":9.1874999999999995E-3}]
[9,0.42699999999999999,2.6687499999999999E-2,6.8479999999999999,0.42799999999999999,10.690000000000001,0.66812500000000008,9.6710000000000012,0.60443750000000007,9.9189999999999987,0.61993749999999992,9.7190000000000012,0.60743750000000007,9.6639999999999997,0.60399999999999998,8.9739999999999984,0.5608749999999999,6.2560000000000002,0.39100000000000001,6.8990000000000009,0.43118750000000006,5.1560000000000006,0.32225000000000004,0.89500000000000002,5.5937500000000001E-2]
[10,1.7809999999999997,0.11131249999999998,9.7940000000000005,0.61212500000000003,13.280000000000001,0.83000000000000007,11.858999999999998,0.74118749999999989,11.790000000000003,0.73687500000000017,11.459,0.71618749999999998,11.309999999999999,0.70687499999999992,10.938000000000002,0.68362500000000015,8.6059999999999981,0.53787499999999988,9.761000000000001,0.61006250000000006,7.5399999999999991,0.47124999999999995,2.4340000000000002,0.15212500000000001]
[11,4.5030000000000001,0.28143750000000001,10.91,0.68187500000000001,12.838999999999999,0.80243749999999991,12.130000000000003,0.75812500000000016,12.030999999999999,0.75193749999999993,12.537999999999997,0.78362499999999979,12.197000000000003,0.76231250000000017,12.164999999999999,0.76031249999999995,9.7960000000000029,0.61225000000000018,10.579999999999998,0.66124999999999989,8.1370000000000022,0.50856250000000014,5.3150000000000004,0.33218750000000002]
[12,2.5339999999999998,0.15837499999999999,10.469999999999999,0.65437499999999993,12.910000000000004,0.80687500000000023,13.369999999999997,0.83562499999999984,13.049999999999997,0.81562499999999982,12.868000000000002,0.80425000000000013,12.228000000000002,0.7642500000000001,12.573,0.78581250000000002,10.551999999999996,0.65949999999999975,10.319000000000003,0.64493750000000016,6.6509999999999998,0.41568749999999999,5.6239999999999988,0.35149999999999992]
{"$rows_left_out":20}